{"text_format":"3","workbook":"xlsx","n_sheets":10,"sheets":["FrontPage","BR1","Survey Response Burden","Comments","Transfer","Details","Text","Translate","ValData","PROCESS"],"not_rendered":{"images":2,"external_links":5,"defined_names":32,"comments":3,"pivot_tables":4},"read":"whole","date_system":"1900"}

{"sheet":"FrontPage","index":0,"n_rows":54,"n_cols":14,"rows_kept":54,"merged":[[1,3,1,6],[1,13,1,14],[20,6,21,13],[23,6,24,13],[26,6,27,13],[29,2,29,13],[30,2,30,13],[31,2,31,13],[33,2,33,13],[35,2,35,13],[36,2,38,2],[36,3,36,13],[37,4,37,13],[38,4,38,13],[39,2,39,13],[41,2,41,13],[43,3,43,12],[44,3,44,12]]}
[]
[{"$nulls":3},{"$f":"Text!F4&\", \"&Details!E32","v":"Ffurflen Gofynion y Gyllideb, 2023-24"},{"$nulls":8},"BR1",{"v":1,"d":"1.0"}]
[]
[{"$nulls":3},{"$f":"Text!F5","v":"Awdurdodau bilio yn unig"}]
[]
[]
[{"$nulls":4},1,{"$nulls":6},0]
[]
[{"$nulls":3},{"$f":"Text!F6","v":"Dewiswch eich awdurdod a cywirwch eich cyfeiriad os oes angen"}]
[]
{"$rows_left_out":45}
{"sheet":"BR1","index":1,"n_rows":47,"n_cols":30,"rows_kept":47,"merged":[[3,5,3,7],[3,10,5,10],[6,2,6,7],[10,2,10,7],[10,10,13,11],[10,19,10,20],[11,19,13,19],[11,20,13,20],[12,21,13,21],[12,22,13,22],[12,23,13,23],[12,24,13,24],[12,25,13,25],[16,10,17,10],[16,11,17,11],[20,10,25,11],[30,10,34,11],[37,10,40,11],[40,2,42,7],[44,2,44,4],[46,2,46,4]]}
[{"$nulls":18},{"$f":"ValData!AO48","v":"Dilynwch y cyfarwyddiadau isod wrth lenwi'r dudalen hon:"}]
[null,null,{"$f":"FrontPage!D2","v":"Ffurflen Gofynion y Gyllideb, 2023-24"},{"$nulls":4},{"$f":"FrontPage!M2","v":"BR1"}]
[]
[{"$nulls":3},{"$f":"Text!F24&\":\"","v":"Cod:"},{"$f":"IF(UANumber=0,\"\",UANumber)","v":""},{"$nulls":5},{"$f":"Text!F58","v":"Allwedd ar gyfer celloedd yng ngholofn H:"},{"$f":"Text!F59","v":"mewnbwn"}]
[{"$nulls":3},{"$f":"Text!F25&\":\"","v":"Awdurdod:"},{"$f":"Details!C5","v":"Dewiswch eich awdurdod ar y dudalen flaen"},{"$nulls":6},{"$f":"Text!F60","v":"addasadwy"}]
[{"$nulls":11},{"$f":"Text!F61","v":"wedi cloi"}]
[null,null,"Hyperddolen canllawiau / Notes for guidance hyperlink "]
[{"$nulls":4},"Cymraeg / Welsh","English / Saesneg"]
[]
[]
{"$rows_left_out":38}
{"sheet":"Survey Response Burden","index":2,"n_rows":14,"n_cols":11,"rows_kept":14,"merged":[[5,2,5,10],[6,2,6,10],[7,2,7,10],[8,2,8,10],[9,2,9,10],[19,2,19,10]]}
[]
[null,null,{"$f":"'BR1'!D4&\" \"&'BR1'!E4","v":"Cod: "},{"$f":"'BR1'!D5&\" \"&'BR1'!E5","v":"Awdurdod: Dewiswch eich awdurdod ar y dudalen flaen"},{"$nulls":6},{"$f":"FrontPage!M2&\", \"&Details!E32","v":"BR1, 2023-24"}]
[]
[]
[null,null,{"$f":"Text!F69","v":"Y Baich o Ymateb i'r Arolwg"}]
[null,null,{"$f":"Text!F70","v":"Mae Llywodraeth Cymru yn monitro'r baich o lenwi'r ffurflen casglu data hon. "}]
[null,null,{"$f":"Text!F71","v":"Nodwch yr amser a gymerwyd gennych chi (ac unrhyw gydweithwyr) i baratoi ac anfon y ffurflen. "}]
[null,null,{"$f":"Text!F72","v":"Dylech gynnwys yr amser a dreuliwyd ar weithgarwch i baratoi ac anfon y ffurflen hon yn unig, megis:"}]
[null,null,{"$f":"\"  ● \"&Text!F73","v":"  ● casglu, dadansoddi a chyfuno'r cofnodion a'r data gofynnol"}]
[null,null,{"$f":"\"  ● \"&Text!F74","v":"  ● cwblhau, gwirio, diwygio a chymeradwyo'r ffurflen."}]
{"$rows_left_out":5}
{"sheet":"Comments","index":3,"n_rows":35,"n_cols":11,"rows_kept":35}
[]
[null,null,{"$f":"'BR1'!D4&\" \"&'BR1'!E4","v":"Cod: "},{"$f":"'BR1'!D5&\" \"&'BR1'!E5","v":"Awdurdod: Dewiswch eich awdurdod ar y dudalen flaen"},{"$nulls":6},{"$f":"FrontPage!M2&\", \"&Details!E32","v":"BR1, 2023-24"}]
[]
[]
[null,null,{"$f":"Text!F81","v":"Dyluniad y ffurflen"}]
{"$rows_empty":9}
[null,null,{"$f":"Text!F82","v":"Dilysu"}]
{"$rows_empty":9}
[null,null,{"$f":"Text!F83","v":"Dogfennaeth"}]
{"$rows_empty":9}
{"$rows_left_out":2}
{"sheet":"Transfer","index":4,"n_rows":102,"n_cols":27,"rows_kept":102,"hidden":true}
[null,"_tab1  (range A3:F21)",{"$nulls":9},"Letter  (range K3:L102)"]
[{"$nulls":14},"tblCurrent"]
["Version","YearCode","FormRef","RowRef","ColumnRef","AuthCode","Data",{"$nulls":4},1,"A",null,"YearCode","FormRef","RowRef","ColumnRef","AuthCode","Data",null,"Year","FormRef","Row","Col","Code","Data"]
[{"$f":"FrontPage!$N$2","v":1},{"$f":"Year","v":202324},"BR1",1,1,{"$f":"UANumber","v":0},{"$f":"VLOOKUP(D4,BR,6,FALSE)","v":0},null,0.00503,{"$f":"+G4*I4","v":0},null,2,"B",null,202324,"BR1",1,1,520,15,null,{"$f":"B4-O4","v":{"v":0,"d":"0.000"}},{"$f":"C4-P4","v":{"$error":"#VALUE!"}},{"v":0,"d":"0.000"},{"v":0,"d":"0.000"},{"v":-520,"d":"-520.000"},{"v":-15,"d":"-15.000"}]
[{"$f":"FrontPage!$N$2","v":1},202324,"BR1",2,1,{"$f":"UANumber","v":0},0,null,{"v":0.4358,"d":"0.43580"},{"$f":"+G5*I5","v":0},null,3,"C",null,202324,"BR1",2,1,520,14,null,{"$f":"B5-O5","v":{"v":0,"d":"0.000"}},{"$f":"C5-P5","v":{"$error":"#VALUE!"}},{"$f":"D5-Q5","v":{"v":0,"d":"0.000"}},{"$f":"E5-R5","v":{"v":0,"d":"0.000"}},{"$f":"F5-S5","v":{"v":-520,"d":"-520.000"}},{"$f":"G5-T5","v":{"v":-14,"d":"-14.000"}}]
[{"$f":"FrontPage!$N$2","v":1},202324,"BR1",3,1,0,0,null,0.91448,0,null,4,"D",null,202324,"BR1",3,1,520,{"v":51318272,"d":"51,318,272"},null,{"v":0,"d":"0.000"},{"$error":"#VALUE!"},{"v":0,"d":"0.000"},{"v":0,"d":"0.000"},{"v":-520,"d":"-520.000"},{"v":-51318272,"d":"-51,318,272.000"}]
[{"$f":"FrontPage!$N$2","v":1},202324,"BR1",4,1,0,0,null,0.90026,0,null,5,"E",null,202324,"BR1",4,1,520,{"v":155459889,"d":"155,459,889"},null,{"v":0,"d":"0.000"},{"$error":"#VALUE!"},{"v":0,"d":"0.000"},{"v":0,"d":"0.000"},{"v":-520,"d":"-520.000"},{"v":-155459889,"d":"-155,459,889.000"}]
[{"$f":"FrontPage!$N$2","v":1},202324,"BR1",5,1,0,0,null,{"v":0.7171,"d":"0.71710"},0,null,6,"F",null,202324,"BR1",5,1,520,{"v":-206778132,"d":"-206,778,132 "},null,{"v":0,"d":"0.000"},{"$error":"#VALUE!"},{"v":0,"d":"0.000"},{"v":0,"d":"0.000"},{"v":-520,"d":"-520.000"},{"v":206778132,"d":"206,778,132.000"}]
[{"$f":"FrontPage!$N$2","v":1},202324,"BR1",6,1,0,0,null,0.89215,0,null,7,"G",null,202324,"BR1",6,1,520,{"v":66614.37,"d":"66,614"},null,{"v":0,"d":"0.000"},{"$error":"#VALUE!"},{"v":0,"d":"0.000"},{"v":0,"d":"0.000"},{"v":-520,"d":"-520.000"},{"v":-66614.37,"d":"-66,614.370"}]
[{"$f":"FrontPage!$N$2","v":1},202324,"BR1",7,1,0,{"v":0,"d":"0.000"},null,0.11462,0,null,8,"H",null,202324,"BR1",7,1,520,{"v":0.988,"d":"1"},null,{"v":0,"d":"0.000"},{"$error":"#VALUE!"},{"v":0,"d":"0.000"},{"v":0,"d":"0.000"},{"v":-520,"d":"-520.000"},-0.988]
{"$rows_left_out":93}
{"sheet":"Details","index":5,"n_rows":61,"n_cols":44,"rows_kept":61,"hidden":true,"merged":[[0,21,0,26],[3,37,4,39],[4,2,4,3],[4,29,4,31],[4,33,4,35],[4,41,4,43],[32,24,32,26],[32,29,33,31],[32,37,33,39],[32,41,33,43]]}
[{"$nulls":21},"Data",{"$nulls":6},"From our CT1:",{"$nulls":4},"Set qrys below to relevant year: ",{"$f":"Year","v":202324}]
[null,null,"UANumber","UA Drop-down box (FrontPage)","DO NOT DELETE - List for Language Drop-Down",null,"Language Drop-down box (FrontPage)",null,"SQL","  Adresses updated on 21.01.20  fk",null,null,"Name Ranges are in purple:",{"$nulls":6},"KEY",null,"Figures in Y8:Z30 are in full pounds !",{"$nulls":4},"Number",null,"TaxBasePivot",null,null,"SQL",null,"Percent",null,"SQL",null,null,"DiscountDwellings ","SQL",null,"ClassO",null,"SQL"]
[null,null,{"$f":"VLOOKUP(FrontPage!$F$12,Authority,2,FALSE)","v":0},{"$f":"FrontPage!F12","v":1},"Cymraeg / Welsh","Mawrth",{"$f":"FrontPage!$E$7","v":1},{"$nulls":12},"Update from tables in web link"]
[null,null,"Selected Authority Name",null,"English / Saesneg","March","Latest Return Date",null,"P:\\stats\\sd3\\Contact Details.mdb",null,"Query for BR1 form",{"$nulls":8},"DO NOT DELETE",{"$nulls":4},"(From LGF colleagues)",null,"(From our CT1)",{"$nulls":10},"6 CT base before collection rate adj. (2 dp)"]
[null,null,{"$f":"IF(D3=0,\"\",VLOOKUP(D3,Authority,5,FALSE))","v":"Dewiswch eich awdurdod ar y dudalen flaen"},null,null,{"$f":"IF(G3=1,F3,F4)","v":"Mawrth"},{"$f":"14&\" \"&$F$5&\" \"&LEFT(Year,4)","v":"14 Mawrth 2023"},{"$nulls":12},"Update from DB query for correct year",null,1,2,3,4,5,6,null,"BR1:","9 CT base for tax-setting purposes (lines 6 x 7 + 8)",{"$nulls":3},"7 Collection rate assumed (2 dp)",{"$nulls":7},"8 Class O exempt dwellings (2 dp)"]
["Authority",null,"this doesn't change often but stil needs to be checked.",null,null,"YCLLL.trosglwyddo@llyw.cymru","LGFS.Transfer@gov.wales",null,"CFO and BR contacts",null,"Addresses",{"$nulls":10},"Data",{"$nulls":6},"Sum of Data2",null,"YearCode","RowRef",null,"Sum of Data2","YearCode","RowRef",null,"Sum of Data2","YearCode","RowRef",null,"Sum of Data2","YearCode","RowRef"]
["Index","UACode","UAName","UAName (W)","List for Authority Drop-Down",null,{"$f":"IF(G3=1,F6,G6)","v":"YCLLL.trosglwyddo@llyw.cymru"},null,1,2,3,4,5,6,7,8,9,10,11,12,{"$nulls":4},{"$f":"Year","v":202324},{"$f":"Year","v":202324},{"$f":"Year","v":202324},{"$nulls":3},202324,{"$nulls":3},202324,{"$nulls":3},202324,{"$nulls":3},202324]
[1,0,"Please select your authority on the FrontPage","Dewiswch eich awdurdod ar y dudalen flaen",{"$f":"IF($G$3=1,D8,C8)","v":"Dewiswch eich awdurdod ar y dudalen flaen"},{"$nulls":3},"UACode","AuthorityName","CFOName","Address1","Address2","Address3","Address4","Postcode","BRName","BRSTDCde","BRTelephone","BREMail",null,"UACode","Welsh / English","UAName","RSG","NDR","Taxbase",null,"AuthCode","Authority name",26,null,null,"AuthCode",23,null,null,"AuthCode",22,null,null,"AuthCode",25]
[2,512,"Isle of Anglesey County Council","Cyngor Sir Ynys Môn","Cyngor Sir Ynys Môn",{"$nulls":3},512,"Cyngor Sir Ynys Môn","Marc Jones","Swyddfeydd y Cyngor","Llangefni","Ynys Môn",null,"LL77 7TW","Glyn Newnes",1248,752602,"GlynNewnes@ynysmon.gov.uk; BethanOwen2@ynysmon.gov.uk",null,512,"W","Cyngor Sir Ynys Môn",{"$f":"SUM(Y39:Z39)","v":{"v":100842008,"d":"100,842,008"}},{"$f":"AA39","v":{"v":22822905,"d":"22,822,905"}},{"$f":"VLOOKUP(V9,TaxBasePivot,3)","v":{"v":32819.56,"d":"32,819.56"}},null,512,"Isle of Anglesey",{"v":32819.56,"d":"32,819.56"},null,null,512,{"v":98.5,"d":"98.50"},null,null,512,{"v":33178.33,"d":"33,178.33"},null,null,512,{"v":138.9,"d":"139"}]
[3,514,"Gwynedd Council","Cyngor Gwynedd","Cyngor Gwynedd",{"$nulls":3},514,"Cyngor Gwynedd","Mr Dewi Aeron Morgan","Swyddfa'r Cyngor","Stryd y Jêl","Caernarfon","Gwynedd","LL55 1SH","Ffion Madog Evans",1286,679406,"FfionMadogEvans@gwynedd.llyw.cymru",null,514,"W","Cyngor Gwynedd",{"v":188864012,"d":"188,864,012"},{"v":39171960,"d":"39,171,960"},{"v":56182.77,"d":"56,182.77"},null,514,"Gwynedd",{"v":56182.77,"d":"56,182.77"},null,null,514,{"v":99,"d":"99.00"},null,null,514,{"v":56750.270000000004,"d":"56,750.27"},null,null,514,0]
{"$rows_left_out":52}
{"sheet":"Text","index":6,"n_rows":93,"n_cols":6,"rows_kept":93,"hidden":true}
["Text Conversion Tables"]
["Row Ref","English Text","Line Info E","Welsh Text","Line Info W","Display Text"]
["FrontPage"]
[null,"Budget Requirement Return",null,{"$f":"VLOOKUP(B4,Translate!$B$3:$E$1399,3,FALSE)","v":"Ffurflen Gofynion y Gyllideb"},{"$f":"IF(ISERROR(VLOOKUP(C4,Translate!$B$3:$E$1254,3,FALSE)),\"\",VLOOKUP(C4,Translate!$B$3:$E$1254,3,FALSE))","v":""},{"$f":"IF(FrontPage!$E$7=1,D4&E4,B4&C4)","v":"Ffurflen Gofynion y Gyllideb"}]
[null,"Billing authorities only",null,{"$f":"VLOOKUP(B5,Translate!$B$3:$E$1399,3,FALSE)","v":"Awdurdodau bilio yn unig"},null,{"$f":"IF(FrontPage!$E$7=1,D5&E5,B5&C5)","v":"Awdurdodau bilio yn unig"}]
[null,"Please select your authority and if necessary, amend any incorrect details",null,{"$f":"VLOOKUP(B6,Translate!$B$3:$E$1399,3,FALSE)","v":"Dewiswch eich awdurdod a cywirwch eich cyfeiriad os oes angen"},{"$f":"IF(ISERROR(VLOOKUP(C6,Translate!$B$3:$E$1254,3,FALSE)),\"\",VLOOKUP(C6,Translate!$B$3:$E$1254,3,FALSE))","v":""},{"$f":"IF(FrontPage!$E$7=1,D6&E6,B6&C6)","v":"Dewiswch eich awdurdod a cywirwch eich cyfeiriad os oes angen"}]
[null,"Name:",null,{"$f":"VLOOKUP(B7,Translate!$B$3:$E$1399,3,FALSE)","v":"Enw:"},{"$f":"IF(ISERROR(VLOOKUP(C7,Translate!$B$3:$E$1254,3,FALSE)),\"\",VLOOKUP(C7,Translate!$B$3:$E$1254,3,FALSE))","v":""},{"$f":"IF(FrontPage!$E$7=1,D7&E7,B7&C7)","v":"Enw:"}]
[null,"E-mail (please enter N/A if unavailable):",null,{"$f":"VLOOKUP(B8,Translate!$B$3:$E$1399,3,FALSE)","v":"E-bost (rhowch Amh os nad yw ar gael):"},{"$f":"IF(ISERROR(VLOOKUP(C8,Translate!$B$3:$E$1254,3,FALSE)),\"\",VLOOKUP(C8,Translate!$B$3:$E$1254,3,FALSE))","v":""},{"$f":"IF(FrontPage!$E$7=1,D8&E8,B8&C8)","v":"E-bost (rhowch Amh os nad yw ar gael):"}]
[null,"Telephone:",null,{"$f":"VLOOKUP(B9,Translate!$B$3:$E$1399,3,FALSE)","v":"Ffôn:"},{"$f":"IF(ISERROR(VLOOKUP(C9,Translate!$B$3:$E$1254,3,FALSE)),\"\",VLOOKUP(C9,Translate!$B$3:$E$1254,3,FALSE))","v":""},{"$f":"IF(FrontPage!$E$7=1,D9&E9,B9&C9)","v":"Ffôn:"}]
[null,"Number and extension:",null,{"$f":"VLOOKUP(B10,Translate!$B$3:$E$1399,3,FALSE)","v":"Rhif ac estyniad:"},{"$f":"IF(ISERROR(VLOOKUP(C10,Translate!$B$3:$E$1254,3,FALSE)),\"\",VLOOKUP(C10,Translate!$B$3:$E$1254,3,FALSE))","v":""},{"$f":"IF(FrontPage!$E$7=1,D10&E10,B10&C10)","v":"Rhif ac estyniad:"}]
{"$rows_left_out":84}
{"sheet":"Translate","index":7,"n_rows":1388,"n_cols":5,"rows_kept":1388,"hidden":true}
[null,"tblTranslate"]
[null,"English","Line Info E","Welsh","Line Info W"]
[null,"For information",null,"Er gwybodaeth"]
[null,"Expenditure and income",null,"Gwariant ac incwm"]
[null,"discretionary non-domestic rate relief",null,"Rhyddhad ardrethi annomestig dewisiol"]
[null,"Revenue support grant (including floor funding)",null,"Grant cynnal refeniw (gan gynnwys cyllido gwaelodol)"]
[null,"Band D equivalent dwellings",null,"Anheddau cyfwerth â Band D"]
[null,"Class O exempt dwellings (adjustable,",null,"Anheddau Dosbarth O wedi'u heithrio (addasadwy,"]
[null,"collection rate assumed (adjustable,",null,"Cyfradd gasglu dybiedig (addasadwy,"]
[null,"Council tax base before collection rate adjustment (adjustable,",null,"Sylfaen y dreth gyngor cyn addasiad gyfradd casglu (addasadwy, "]
{"$rows_left_out":1379}
{"sheet":"ValData","index":8,"n_rows":795,"n_cols":41,"rows_kept":795,"hidden":true}
[{"$nulls":18},"AllRows Copy/pasted to filter out T/E rows from validations",{"$nulls":14},{"$f":"\">=\"&Year-202","v":">=202122"},null,null,"SQL"]
[null,"YOYOut",{"$nulls":27},"DataIn"]
[null,"YearCode","FormRef","RowRef","ColumnRef","AuthCode","DataY1","DataY2","DataY3","Auto","Mark","Check","Status","Your Comments","Our Comments","Initials","Date",null,null,"Row","T","StandDesc","Short E","StandWelsh","Short W",{"$nulls":4},"Column1","FormRef","AuthCode","RowRef","StandDesc","ColumnRef","YearCode","Data",null,"Bilingual text for text boxes on BR1 page"]
[null,{"$f":"LEFT(Year,4)&RIGHT(Year,2)","v":"202324"},"BR1",{"$f":"T4","v":1},{"$f":"1","v":1},{"$f":"UANumber","v":0},{"$f":"VLOOKUP($D4,LineData,2,FALSE)","v":{"$error":"#N/A"}},{"$f":"VLOOKUP($D4,LineData,3,FALSE)","v":{"$error":"#N/A"}},{"$f":"VLOOKUP($D4,LineData,4,FALSE)","v":0},{"$f":"VLOOKUP($D4,LineData,10,FALSE)","v":0},{"$f":"VLOOKUP($D4,LineData,11,FALSE)","v":0},{"$f":"VLOOKUP($D4,LineData,12,FALSE)","v":0},{"$f":"VLOOKUP($D4,LineData,13,FALSE)","v":0},{"$f":"VLOOKUP($D4,LineData,14,FALSE)","v":0},{"$f":"VLOOKUP($D4,LineData,15,FALSE)","v":0},{"$f":"VLOOKUP($D4,LineData,16,FALSE)","v":0},{"$f":"IF(ISERROR(VLOOKUP($D4,ValData!$S$4:$AB$16,10,FALSE)),0,IF(VLOOKUP($D4,ValData!$S$4:$AB$16,10,FALSE)=\"\",0,VLOOKUP($D4,ValData!$S$4:$AB$16,10,FALSE)))","v":"00:00:00"},null,null,1,"T","Budget requirement (including community council precepts)",null,{"$f":"VLOOKUP(T4,Text!$A$28:$D$47,4,FALSE)","v":"Gofyniad cyllidebol"},{"$nulls":5},{"$f":"AF4&\"_\"&AG4&\"_\"&AJ4","v":"512_1_202122"},"BR1",512,1,"Budget requirement (including community council precepts)",1,202122,{"v":148656213,"d":"148,656,213"},null,"English","Welsh","Displayed Text"]
[null,"202324","BR1",2,{"$f":"1","v":1},0,{"$error":"#N/A"},{"$error":"#N/A"},0,{"$error":"#N/A"},0,0,0,0,0,0,{"$f":"IF(ISERROR(VLOOKUP($D5,ValData!$S$4:$AB$16,10,FALSE)),0,IF(VLOOKUP($D5,ValData!$S$4:$AB$16,10,FALSE)=\"\",0,VLOOKUP($D5,ValData!$S$4:$AB$16,10,FALSE)))","v":"00:00:00"},null,null,2,"E","Discretionary non-domestic rate relief",null,{"$f":"VLOOKUP(T5,Text!$A$28:$D$47,4,FALSE)","v":"Rhyddhad ardrethi annomestig dewisiol"},{"$nulls":5},"514_1_202122","BR1",514,1,"Budget requirement (including community council precepts)",1,202122,{"v":277717730,"d":"277,717,730"},null,"After completing the form - check any flagged figures (marked ‘1’ in the ‘Auto’ column) that are either outside tolerance (>5%) or not equal to zero (see ‘Arithmetic Checks’ section)","Ar ôl cwblhau’r ffurflen - gwiriwch unrhyw ffigurau sydd gyda fflag eu bod tu hwnt i’r goddefiant (>5%) neu ddim yn hafal i sero wedi'i farcio '1' yn y golofn 'Awtomatig'(gweler yr adran ‘Gwiriadau Rhifyddol’). ",{"$f":"IF(Details!$G$3=2,ValData!AM5,ValData!AN5)","v":"Ar ôl cwblhau’r ffurflen - gwiriwch unrhyw ffigurau sydd gyda fflag eu bod tu hwnt i’r goddefiant (>5%) neu ddim yn hafal i sero wedi'i farcio '1' yn y golofn 'Awtomatig'(gweler yr adran ‘Gwiriadau Rhifyddol’). "}]
[null,"202324","BR1",3,{"$f":"1","v":1},0,{"$error":"#N/A"},{"$error":"#N/A"},0,0,0,0,0,0,0,0,{"$f":"IF(ISERROR(VLOOKUP($D6,ValData!$S$4:$AB$16,10,FALSE)),0,IF(VLOOKUP($D6,ValData!$S$4:$AB$16,10,FALSE)=\"\",0,VLOOKUP($D6,ValData!$S$4:$AB$16,10,FALSE)))","v":"00:00:00"},null,null,3,null,"Re-distributed non-domestic rates",null,{"$f":"VLOOKUP(T6,Text!$A$28:$D$47,4,FALSE)","v":"Ail-ddosbarthu ardrethi annomestig"},{"$nulls":5},"516_1_202122","BR1",516,1,"Budget requirement (including community council precepts)",1,202122,{"v":239635829,"d":"239,635,829"},null,"The line tolerance limits (columns M and N) are either pre-set or can be adjusted manually (currently set at 50 and 5% - cells M7 and N7).","Mae’r terfynau goddefiant llinell (colofnau M ac N) naill ai wedi eu bennu ymlaen llaw, neu gellir addasu eich hun (ar hyn o bryd wedi eu gosod at 50 a 5%-celloedd M7 a N7).   ",{"$f":"IF(Details!$G$3=2,ValData!AM6,ValData!AN6)","v":"Mae’r terfynau goddefiant llinell (colofnau M ac N) naill ai wedi eu bennu ymlaen llaw, neu gellir addasu eich hun (ar hyn o bryd wedi eu gosod at 50 a 5%-celloedd M7 a N7).   "}]
[null,"202324","BR1",4,{"$f":"1","v":1},0,{"$error":"#N/A"},{"$error":"#N/A"},0,0,0,0,0,0,0,0,{"$f":"IF(ISERROR(VLOOKUP($D7,ValData!$S$4:$AB$16,10,FALSE)),0,IF(VLOOKUP($D7,ValData!$S$4:$AB$16,10,FALSE)=\"\",0,VLOOKUP($D7,ValData!$S$4:$AB$16,10,FALSE)))","v":"00:00:00"},null,null,4,null,"Revenue support grant",null,{"$f":"VLOOKUP(T7,Text!$A$28:$D$47,4,FALSE)","v":"Grant cynnal refeniw (gan gynnwys cyllido gwaelodol)"},{"$nulls":5},"518_1_202122","BR1",518,1,"Budget requirement (including community council precepts)",1,202122,{"v":219056094,"d":"219,056,094"},null,"If you wish to add supporting information to any row please put it in ‘Your Comments’, otherwise an email confirming that you are happy with the figures will do. ","Os ydych am ychwanegu gwybodaeth ategol i unrhyw res, rhowch yn 'Eich sylwadau', fel arall bydd e-bost yn cadarnhau eich bod yn fodlon ar y ffigurau yn ddigon. ",{"$f":"IF(Details!$G$3=2,ValData!AM7,ValData!AN7)","v":"Os ydych am ychwanegu gwybodaeth ategol i unrhyw res, rhowch yn 'Eich sylwadau', fel arall bydd e-bost yn cadarnhau eich bod yn fodlon ar y ffigurau yn ddigon. "}]
[null,"202324","BR1",5,{"$f":"1","v":1},0,{"$error":"#N/A"},{"$error":"#N/A"},0,0,0,0,0,0,0,0,{"$f":"IF(ISERROR(VLOOKUP($D8,ValData!$S$4:$AB$16,10,FALSE)),0,IF(VLOOKUP($D8,ValData!$S$4:$AB$16,10,FALSE)=\"\",0,VLOOKUP($D8,ValData!$S$4:$AB$16,10,FALSE)))","v":"00:00:00"},null,null,5,"T","Amount to be collected from the council tax",null,{"$f":"VLOOKUP(T8,Text!$A$28:$D$47,4,FALSE)","v":"Swm i'w casglu o'r dreth gyngor"},{"$nulls":5},"520_1_202122","BR1",520,1,"Budget requirement (including community council precepts)",1,202122,{"v":300533982,"d":"300,533,982"},null,"After receiving the completed form - we will mark any rows that we think need to be cleared using the 'Check' column along with adding any comments and/or","Ar ôl derbyn y ffurflen wedi'i chwblhau - bydden yn nodi unrhyw rhesi y credwn y mae angen eu clirio gan ddefnyddio y golofn 'Gwirio' ynghyd ag ychwanegu unrhyw sylwadau a/neu ",{"$f":"IF(Details!$G$3=2,ValData!AM8,ValData!AN8)","v":"Ar ôl derbyn y ffurflen wedi'i chwblhau - bydden yn nodi unrhyw rhesi y credwn y mae angen eu clirio gan ddefnyddio y golofn 'Gwirio' ynghyd ag ychwanegu unrhyw sylwadau a/neu "}]
[null,"202324","BR1",6,{"$f":"1","v":1},0,{"$error":"#N/A"},{"$error":"#N/A"},0,{"$error":"#N/A"},0,0,0,0,0,0,{"$f":"IF(ISERROR(VLOOKUP($D9,ValData!$S$4:$AB$16,10,FALSE)),0,IF(VLOOKUP($D9,ValData!$S$4:$AB$16,10,FALSE)=\"\",0,VLOOKUP($D9,ValData!$S$4:$AB$16,10,FALSE)))","v":"00:00:00"},null,null,6,null,"Council tax base before collection rate adjustment",null,{"$f":"VLOOKUP(T9,Text!$A$28:$D$47,4,FALSE)","v":"Sylfaen y dreth gyngor cyn addasiad gyfradd casglu (addasadwy, "},{"$nulls":5},"522_1_202122","BR1",522,1,"Budget requirement (including community council precepts)",1,202122,{"v":262010239,"d":"262,010,239"},null,"any relevant previous comments provided by your authority in the 'Our Comments' column. We may ask you for further information if required. ","unrhyw sylwadau blaenorol perthnasol a ddarperir gan eich awdurdod yn y golofn 'Ein sylwadau’. Gallem ofyn i chi am ragor o wybodaeth os oes angen.",{"$f":"IF(Details!$G$3=2,ValData!AM9,ValData!AN9)","v":"unrhyw sylwadau blaenorol perthnasol a ddarperir gan eich awdurdod yn y golofn 'Ein sylwadau’. Gallem ofyn i chi am ragor o wybodaeth os oes angen."}]
[null,"202324","BR1",7,{"$f":"1","v":1},0,{"$error":"#N/A"},{"$error":"#N/A"},0,{"$error":"#N/A"},0,0,0,0,0,0,{"$f":"IF(ISERROR(VLOOKUP($D10,ValData!$S$4:$AB$16,10,FALSE)),0,IF(VLOOKUP($D10,ValData!$S$4:$AB$16,10,FALSE)=\"\",0,VLOOKUP($D10,ValData!$S$4:$AB$16,10,FALSE)))","v":"00:00:00"},null,null,7,null,"Collection rate assumed",null,{"$f":"VLOOKUP(T10,Text!$A$28:$D$47,4,FALSE)","v":"Cyfradd gasglu dybiedig (addasadwy,"},{"$nulls":5},"524_1_202122","BR1",524,1,"Budget requirement (including community council precepts)",1,202122,{"v":283824827,"d":"283,824,827"},null,"Any cleared items will be marked 'C' in the 'Status' column (column AA).","Bydd unrhyw eitem sydd wedi'i glirio wedi’i marcio 'C' yn y golofn 'Statws' (Colofn AA).",{"$f":"IF(Details!$G$3=2,ValData!AM10,ValData!AN10)","v":"Bydd unrhyw eitem sydd wedi'i glirio wedi’i marcio 'C' yn y golofn 'Statws' (Colofn AA)."}]
{"$rows_left_out":786}
{"sheet":"PROCESS","index":9,"n_rows":119,"n_cols":18,"rows_kept":119,"hidden":true,"merged":[[1,11,2,11],[1,15,2,15]]}
[]
[{"$nulls":11},"Input / Output",{"$nulls":3},"Protect and hide page?","Updated"]
[null,"Page",null,"Type (?)",null,"Action",null,"Range name",null,"Range",{"$nulls":3},"Comments",null,null,"By","Date Updated"]
[]
[1,"Details",null,"active",null,"update",null,"year",null,"A1",null,"I",{"$nulls":3},"Y","FK"]
[{"$nulls":7},"return date",null,"G5",null,"I",{"$nulls":4},"BA","2023-01-18"]
[{"$nulls":7},"Authority",null,"A6:E29",null,"I",{"$nulls":4},"FK"]
[{"$nulls":7},"Addresses",null,"I7:T29",null,"I",{"$nulls":4},"BA","2023-01-18"]
[{"$nulls":7},"TaxBasePivot",null,"AD5:AG30",null,"I",{"$nulls":4},"BA","2023-01-18"]
[{"$nulls":7},"Percent",null,"AI5:AK30",null,"I",{"$nulls":4},"BA","2023-01-18"]
{"$rows_left_out":101}